{"text_format":"1","workbook":"xlsx","n_sheets":3,"sheets":["Gruppenphase","Hauptfeld","Trostrunde"],"not_rendered":{"charts":0,"images":0,"macros":1,"external_links":0,"defined_names":3,"comments":2,"pivot_tables":0},"unopened":[],"bounds":{"document_bytes":16777216,"sheet_cells":100000,"rows_first":2000,"rows_last":500,"rows_between":2000,"halvings":0,"cell_chars":16384,"cell_head_chars":4096},"cells_cut":0,"cells_raw":0,"read":"whole","date_system":"1900"}

{"sheet":"Gruppenphase","index":0,"n_rows":39,"n_cols":19,"rows_kept":39,"cut":false,"hidden":false,"merged":[[0,0,0,1],[0,10,0,11],[0,2,0,3],[0,4,0,5],[0,6,0,7],[0,8,0,9],[5,10,5,11],[10,0,10,1],[10,2,10,3],[10,4,10,5],[10,6,10,7],[10,8,10,9],[10,10,10,11],[5,0,5,1],[5,2,5,3],[5,4,5,5],[5,6,5,7],[5,8,5,9],[15,10,15,11],[20,0,20,1],[20,2,20,3],[20,4,20,5],[20,6,20,7],[20,8,20,9],[20,10,20,11],[15,0,15,1],[15,2,15,3],[15,4,15,5],[15,6,15,7],[15,8,15,9],[25,10,25,11],[30,0,30,1],[30,2,30,3],[30,4,30,5],[30,6,30,7],[30,8,30,9],[30,10,30,11],[25,0,25,1],[25,2,25,3],[25,4,25,5],[25,6,25,7],[25,8,25,9],[35,10,35,11],[35,0,35,1],[35,2,35,3],[35,4,35,5],[35,6,35,7],[35,8,35,9]]}
["Gruppe 1",null,1,null,2,null,3,null,"Spiele",null,"Punkte",null,"Platz",null,null,"Paarungen"]
[1,"Langwaldt/Jensen/Hamer",null,null,{"$f":"IF(AND(Q4=0,R4=0),\"\",Q4)","v":3},{"$f":"IF(AND(Q4=0,R4=0),\"\",R4)","v":1},{"$f":"IF(AND(Q3=0,R3=0),\"\",Q3)","v":3},{"$f":"IF(AND(Q3=0,R3=0),\"\",R3)","v":1},{"$f":"IF(AND(E2<>\"\",G2<>\"\"),E2+G2,\"\")","v":6},{"$f":"IF(AND(F2<>\"\",H2<>\"\"),F2+H2,\"\")","v":2},4,0,1,"I",null,{"$f":"IF(AND($B3<>\"\",$B4<>\"\"),$B3,\"\")","v":"Benz/Peters/Wieben"},2,2,{"$f":"IF(AND($B4<>\"\",$B3<>\"\"),$B4,\"\")","v":"Krüger/Krüger/Harth"}]
[2,"Benz/Peters/Wieben",{"$f":"F2","v":1},{"$f":"E2","v":3},null,null,{"$f":"IF(AND(Q2=0,R2=0),\"\",Q2)","v":2},{"$f":"IF(AND(Q2=0,R2=0),\"\",R2)","v":2},{"$f":"IF(AND(C3<>\"\",G3<>\"\"),C3+G3,\"\")","v":3},{"$f":"IF(AND(D3<>\"\",H3<>\"\"),D3+H3,\"\")","v":5},1,3,2,"II",null,{"$f":"IF(AND($B2<>\"\",$B4<>\"\"),$B2,\"\")","v":"Langwaldt/Jensen/Hamer"},3,1,{"$f":"IF(AND($B4<>\"\",$B2<>\"\"),$B4,\"\")","v":"Krüger/Krüger/Harth"}]
[3,"Krüger/Krüger/Harth",{"$f":"H2","v":1},{"$f":"G2","v":3},{"$f":"H3","v":2},{"$f":"G3","v":2},null,null,{"$f":"IF(AND(C4<>\"\",E4<>\"\"),C4+E4,\"\")","v":3},{"$f":"IF(AND(D4<>\"\",F4<>\"\"),D4+F4,\"\")","v":5},1,3,3,"III",null,{"$f":"IF(AND($B2<>\"\",$B3<>\"\"),$B2,\"\")","v":"Langwaldt/Jensen/Hamer"},3,1,{"$f":"IF(AND($B3<>\"\",$B2<>\"\"),$B3,\"\")","v":"Benz/Peters/Wieben"}]
[]
["Gruppe 2",null,1,null,2,null,3,null,"Spiele",null,"Punkte",null,"Platz",null,null,"Paarungen"]
[1,"Fust/Scholz/Garbe",null,null,{"$f":"IF(AND(Q9=0,R9=0),\"\",Q9)","v":1},{"$f":"IF(AND(Q9=0,R9=0),\"\",R9)","v":3},{"$f":"IF(AND(Q8=0,R8=0),\"\",Q8)","v":1},{"$f":"IF(AND(Q8=0,R8=0),\"\",R8)","v":3},{"$f":"IF(AND(E7<>\"\",G7<>\"\"),E7+G7,\"\")","v":2},{"$f":"IF(AND(F7<>\"\",H7<>\"\"),F7+H7,\"\")","v":6},0,4,3,"I",null,{"$f":"IF(AND($B8<>\"\",$B9<>\"\"),$B8,\"\")","v":"Rothenhäuser/Teuber/Koglin"},1,3,{"$f":"IF(AND($B9<>\"\",$B8<>\"\"),$B9,\"\")","v":"Hickisch/Michalski/Trinh"}]
[2,"Rothenhäuser/Teuber/Koglin",{"$f":"F7","v":3},{"$f":"E7","v":1},null,null,{"$f":"IF(AND(Q7=0,R7=0),\"\",Q7)","v":1},{"$f":"IF(AND(Q7=0,R7=0),\"\",R7)","v":3},{"$f":"IF(AND(C8<>\"\",G8<>\"\"),C8+G8,\"\")","v":4},{"$f":"IF(AND(D8<>\"\",H8<>\"\"),D8+H8,\"\")","v":4},2,2,2,"II",null,{"$f":"IF(AND($B7<>\"\",$B9<>\"\"),$B7,\"\")","v":"Fust/Scholz/Garbe"},1,3,{"$f":"IF(AND($B9<>\"\",$B7<>\"\"),$B9,\"\")","v":"Hickisch/Michalski/Trinh"}]
[3,"Hickisch/Michalski/Trinh",{"$f":"H7","v":3},{"$f":"G7","v":1},{"$f":"H8","v":3},{"$f":"G8","v":1},null,null,{"$f":"IF(AND(C9<>\"\",E9<>\"\"),C9+E9,\"\")","v":6},{"$f":"IF(AND(D9<>\"\",F9<>\"\"),D9+F9,\"\")","v":2},4,0,1,"III",null,{"$f":"IF(AND($B7<>\"\",$B8<>\"\"),$B7,\"\")","v":"Fust/Scholz/Garbe"},1,3,{"$f":"IF(AND($B8<>\"\",$B7<>\"\"),$B8,\"\")","v":"Rothenhäuser/Teuber/Koglin"}]
[]
["Gruppe 3",null,1,null,2,null,3,null,"Spiele",null,"Punkte",null,"Platz",null,null,"Paarungen"]
[1,"Deichmann/Indinger/Fittkau",null,null,{"$f":"IF(AND(Q14=0,R14=0),\"\",Q14)","v":1},{"$f":"IF(AND(Q14=0,R14=0),\"\",R14)","v":3},{"$f":"IF(AND(Q13=0,R13=0),\"\",Q13)","v":1},{"$f":"IF(AND(Q13=0,R13=0),\"\",R13)","v":3},{"$f":"IF(AND(E12<>\"\",G12<>\"\"),E12+G12,\"\")","v":2},{"$f":"IF(AND(F12<>\"\",H12<>\"\"),F12+H12,\"\")","v":6},0,4,3,"I",null,{"$f":"IF(AND($B13<>\"\",$B14<>\"\"),$B13,\"\")","v":"Lubke/Stegemann/Abert"},2,2,{"$f":"IF(AND($B14<>\"\",$B13<>\"\"),$B14,\"\")","v":"Bruchlos/Busch/Lauenroth"}]
[2,"Lubke/Stegemann/Abert",{"$f":"F12","v":3},{"$f":"E12","v":1},null,null,{"$f":"IF(AND(Q12=0,R12=0),\"\",Q12)","v":2},{"$f":"IF(AND(Q12=0,R12=0),\"\",R12)","v":2},{"$f":"IF(AND(C13<>\"\",G13<>\"\"),C13+G13,\"\")","v":5},{"$f":"IF(AND(D13<>\"\",H13<>\"\"),D13+H13,\"\")","v":3},3,1,1,"II",null,{"$f":"IF(AND($B12<>\"\",$B14<>\"\"),$B12,\"\")","v":"Deichmann/Indinger/Fittkau"},1,3,{"$f":"IF(AND($B14<>\"\",$B12<>\"\"),$B14,\"\")","v":"Bruchlos/Busch/Lauenroth"}]
[3,"Bruchlos/Busch/Lauenroth",{"$f":"H12","v":3},{"$f":"G12","v":1},{"$f":"H13","v":2},{"$f":"G13","v":2},null,null,{"$f":"IF(AND(C14<>\"\",E14<>\"\"),C14+E14,\"\")","v":5},{"$f":"IF(AND(D14<>\"\",F14<>\"\"),D14+F14,\"\")","v":3},3,1,2,"III",null,{"$f":"IF(AND($B12<>\"\",$B13<>\"\"),$B12,\"\")","v":"Deichmann/Indinger/Fittkau"},1,3,{"$f":"IF(AND($B13<>\"\",$B12<>\"\"),$B13,\"\")","v":"Lubke/Stegemann/Abert"}]
[]
["Gruppe 4",null,1,null,2,null,3,null,"Spiele",null,"Punkte",null,"Platz",null,null,"Paarungen"]
[1,"Diebold/Tröger/Hoffmann",null,null,{"$f":"IF(AND(Q19=0,R19=0),\"\",Q19)","v":3},{"$f":"IF(AND(Q19=0,R19=0),\"\",R19)","v":1},{"$f":"IF(AND(Q18=0,R18=0),\"\",Q18)","v":1},{"$f":"IF(AND(Q18=0,R18=0),\"\",R18)","v":3},{"$f":"IF(AND(E17<>\"\",G17<>\"\"),E17+G17,\"\")","v":4},{"$f":"IF(AND(F17<>\"\",H17<>\"\"),F17+H17,\"\")","v":4},2,2,2,"I",null,{"$f":"IF(AND($B18<>\"\",$B19<>\"\"),$B18,\"\")","v":"Bohnensack"},1,3,{"$f":"IF(AND($B19<>\"\",$B18<>\"\"),$B19,\"\")","v":"Pätz/Wandmaker/Kostny"}]
[2,"Bohnensack",{"$f":"F17","v":1},{"$f":"E17","v":3},null,null,{"$f":"IF(AND(Q17=0,R17=0),\"\",Q17)","v":1},{"$f":"IF(AND(Q17=0,R17=0),\"\",R17)","v":3},{"$f":"IF(AND(C18<>\"\",G18<>\"\"),C18+G18,\"\")","v":2},{"$f":"IF(AND(D18<>\"\",H18<>\"\"),D18+H18,\"\")","v":6},0,4,3,"II",null,{"$f":"IF(AND($B17<>\"\",$B19<>\"\"),$B17,\"\")","v":"Diebold/Tröger/Hoffmann"},1,3,{"$f":"IF(AND($B19<>\"\",$B17<>\"\"),$B19,\"\")","v":"Pätz/Wandmaker/Kostny"}]
[3,"Pätz/Wandmaker/Kostny",{"$f":"H17","v":3},{"$f":"G17","v":1},{"$f":"H18","v":3},{"$f":"G18","v":1},null,null,{"$f":"IF(AND(C19<>\"\",E19<>\"\"),C19+E19,\"\")","v":6},{"$f":"IF(AND(D19<>\"\",F19<>\"\"),D19+F19,\"\")","v":2},4,0,1,"III",null,{"$f":"IF(AND($B17<>\"\",$B18<>\"\"),$B17,\"\")","v":"Diebold/Tröger/Hoffmann"},3,1,{"$f":"IF(AND($B18<>\"\",$B17<>\"\"),$B18,\"\")","v":"Bohnensack"}]
[]
["Gruppe 5",null,1,null,2,null,3,null,"Spiele",null,"Punkte",null,"Platz",null,null,"Paarungen"]
[1,"Krüger/Krüger/Gutschy",null,null,{"$f":"IF(AND(Q24=0,R24=0),\"\",Q24)","v":2},{"$f":"IF(AND(Q24=0,R24=0),\"\",R24)","v":2},{"$f":"IF(AND(Q23=0,R23=0),\"\",Q23)","v":1},{"$f":"IF(AND(Q23=0,R23=0),\"\",R23)","v":3},{"$f":"IF(AND(E22<>\"\",G22<>\"\"),E22+G22,\"\")","v":3},{"$f":"IF(AND(F22<>\"\",H22<>\"\"),F22+H22,\"\")","v":5},1,3,3,"I",null,{"$f":"IF(AND($B23<>\"\",$B24<>\"\"),$B23,\"\")","v":"Otto/Drücker/Willmann"},2,2,{"$f":"IF(AND($B24<>\"\",$B23<>\"\"),$B24,\"\")","v":"Schmidt/Maier/Jettinger"}]
[2,"Otto/Drücker/Willmann",{"$f":"F22","v":2},{"$f":"E22","v":2},null,null,{"$f":"IF(AND(Q22=0,R22=0),\"\",Q22)","v":2},{"$f":"IF(AND(Q22=0,R22=0),\"\",R22)","v":2},{"$f":"IF(AND(C23<>\"\",G23<>\"\"),C23+G23,\"\")","v":4},{"$f":"IF(AND(D23<>\"\",H23<>\"\"),D23+H23,\"\")","v":4},2,2,2,"II",null,{"$f":"IF(AND($B22<>\"\",$B24<>\"\"),$B22,\"\")","v":"Krüger/Krüger/Gutschy"},1,3,{"$f":"IF(AND($B24<>\"\",$B22<>\"\"),$B24,\"\")","v":"Schmidt/Maier/Jettinger"}]
[3,"Schmidt/Maier/Jettinger",{"$f":"H22","v":3},{"$f":"G22","v":1},{"$f":"H23","v":2},{"$f":"G23","v":2},null,null,{"$f":"IF(AND(C24<>\"\",E24<>\"\"),C24+E24,\"\")","v":5},{"$f":"IF(AND(D24<>\"\",F24<>\"\"),D24+F24,\"\")","v":3},3,1,1,"III",null,{"$f":"IF(AND($B22<>\"\",$B23<>\"\"),$B22,\"\")","v":"Krüger/Krüger/Gutschy"},2,2,{"$f":"IF(AND($B23<>\"\",$B22<>\"\"),$B23,\"\")","v":"Otto/Drücker/Willmann"}]
[]
["Gruppe 6",null,1,null,2,null,3,null,"Spiele",null,"Punkte",null,"Platz",null,null,"Paarungen"]
[1,"Militzer/Braun/Kirschner",null,null,{"$f":"IF(AND(Q29=0,R29=0),\"\",Q29)","v":4},{"$f":"IF(AND(Q29=0,R29=0),\"\",R29)","v":0},{"$f":"IF(AND(Q28=0,R28=0),\"\",Q28)","v":0},{"$f":"IF(AND(Q28=0,R28=0),\"\",R28)","v":4},{"$f":"IF(AND(E27<>\"\",G27<>\"\"),E27+G27,\"\")","v":4},{"$f":"IF(AND(F27<>\"\",H27<>\"\"),F27+H27,\"\")","v":4},2,2,2,"I",null,{"$f":"IF(AND($B28<>\"\",$B29<>\"\"),$B28,\"\")","v":"Dunker/Schulz/Cirksena"},0,4,{"$f":"IF(AND($B29<>\"\",$B28<>\"\"),$B29,\"\")","v":"Mählhop/Ott/Mocker"}]
[2,"Dunker/Schulz/Cirksena",{"$f":"F27","v":0},{"$f":"E27","v":4},null,null,{"$f":"IF(AND(Q27=0,R27=0),\"\",Q27)","v":0},{"$f":"IF(AND(Q27=0,R27=0),\"\",R27)","v":4},{"$f":"IF(AND(C28<>\"\",G28<>\"\"),C28+G28,\"\")","v":0},{"$f":"IF(AND(D28<>\"\",H28<>\"\"),D28+H28,\"\")","v":8},0,4,3,"II",null,{"$f":"IF(AND($B27<>\"\",$B29<>\"\"),$B27,\"\")","v":"Militzer/Braun/Kirschner"},0,4,{"$f":"IF(AND($B29<>\"\",$B27<>\"\"),$B29,\"\")","v":"Mählhop/Ott/Mocker"}]
[3,"Mählhop/Ott/Mocker",{"$f":"H27","v":4},{"$f":"G27","v":0},{"$f":"H28","v":4},{"$f":"G28","v":0},null,null,{"$f":"IF(AND(C29<>\"\",E29<>\"\"),C29+E29,\"\")","v":8},{"$f":"IF(AND(D29<>\"\",F29<>\"\"),D29+F29,\"\")","v":0},4,0,1,"III",null,{"$f":"IF(AND($B27<>\"\",$B28<>\"\"),$B27,\"\")","v":"Militzer/Braun/Kirschner"},4,0,{"$f":"IF(AND($B28<>\"\",$B27<>\"\"),$B28,\"\")","v":"Dunker/Schulz/Cirksena"}]
[]
["Gruppe 7",null,1,null,2,null,3,null,"Spiele",null,"Punkte",null,"Platz",null,null,"Paarungen"]
[1,"Grzymek/Glaeßner/Reinert",null,null,{"$f":"IF(AND(Q34=0,R34=0),\"\",Q34)","v":3},{"$f":"IF(AND(Q34=0,R34=0),\"\",R34)","v":1},{"$f":"IF(AND(Q33=0,R33=0),\"\",Q33)","v":2},{"$f":"IF(AND(Q33=0,R33=0),\"\",R33)","v":2},{"$f":"IF(AND(E32<>\"\",G32<>\"\"),E32+G32,\"\")","v":5},{"$f":"IF(AND(F32<>\"\",H32<>\"\"),F32+H32,\"\")","v":3},3,1,2,"I",null,{"$f":"IF(AND($B33<>\"\",$B34<>\"\"),$B33,\"\")","v":"Mittelstädt/Heide/Voigt"},1,3,{"$f":"IF(AND($B34<>\"\",$B33<>\"\"),$B34,\"\")","v":"Nitz/Grundei/Schlösser"}]
[2,"Mittelstädt/Heide/Voigt",{"$f":"F32","v":1},{"$f":"E32","v":3},null,null,{"$f":"IF(AND(Q32=0,R32=0),\"\",Q32)","v":1},{"$f":"IF(AND(Q32=0,R32=0),\"\",R32)","v":3},{"$f":"IF(AND(C33<>\"\",G33<>\"\"),C33+G33,\"\")","v":2},{"$f":"IF(AND(D33<>\"\",H33<>\"\"),D33+H33,\"\")","v":6},0,4,3,"II",null,{"$f":"IF(AND($B32<>\"\",$B34<>\"\"),$B32,\"\")","v":"Grzymek/Glaeßner/Reinert"},2,2,{"$f":"IF(AND($B34<>\"\",$B32<>\"\"),$B34,\"\")","v":"Nitz/Grundei/Schlösser"}]
[3,"Nitz/Grundei/Schlösser",{"$f":"H32","v":2},{"$f":"G32","v":2},{"$f":"H33","v":3},{"$f":"G33","v":1},null,null,{"$f":"IF(AND(C34<>\"\",E34<>\"\"),C34+E34,\"\")","v":5},{"$f":"IF(AND(D34<>\"\",F34<>\"\"),D34+F34,\"\")","v":3},3,1,1,"III",null,{"$f":"IF(AND($B32<>\"\",$B33<>\"\"),$B32,\"\")","v":"Grzymek/Glaeßner/Reinert"},3,1,{"$f":"IF(AND($B33<>\"\",$B32<>\"\"),$B33,\"\")","v":"Mittelstädt/Heide/Voigt"}]
[]
["Gruppe 8",null,1,null,2,null,3,null,"Spiele",null,"Punkte",null,"Platz",null,null,"Paarungen"]
[1,"Schmidt/Drücker/Mohr",null,null,{"$f":"IF(AND(Q39=0,R39=0),\"\",Q39)","v":3},{"$f":"IF(AND(Q39=0,R39=0),\"\",R39)","v":1},{"$f":"IF(AND(Q38=0,R38=0),\"\",Q38)","v":3},{"$f":"IF(AND(Q38=0,R38=0),\"\",R38)","v":1},{"$f":"IF(AND(E37<>\"\",G37<>\"\"),E37+G37,\"\")","v":6},{"$f":"IF(AND(F37<>\"\",H37<>\"\"),F37+H37,\"\")","v":2},4,0,1,"I",null,{"$f":"IF(AND($B38<>\"\",$B39<>\"\"),$B38,\"\")","v":"Schön/Landau/Bönsch"},4,0,{"$f":"IF(AND($B39<>\"\",$B38<>\"\"),$B39,\"\")","v":"Grote/Dohrn/Ly"}]
[2,"Schön/Landau/Bönsch",{"$f":"F37","v":1},{"$f":"E37","v":3},null,null,{"$f":"IF(AND(Q37=0,R37=0),\"\",Q37)","v":4},{"$f":"IF(AND(Q37=0,R37=0),\"\",R37)","v":0},{"$f":"IF(AND(C38<>\"\",G38<>\"\"),C38+G38,\"\")","v":5},{"$f":"IF(AND(D38<>\"\",H38<>\"\"),D38+H38,\"\")","v":3},2,2,2,"II",null,{"$f":"IF(AND($B37<>\"\",$B39<>\"\"),$B37,\"\")","v":"Schmidt/Drücker/Mohr"},3,1,{"$f":"IF(AND($B39<>\"\",$B37<>\"\"),$B39,\"\")","v":"Grote/Dohrn/Ly"}]
[3,"Grote/Dohrn/Ly",{"$f":"H37","v":1},{"$f":"G37","v":3},{"$f":"H38","v":0},{"$f":"G38","v":4},null,null,{"$f":"IF(AND(C39<>\"\",E39<>\"\"),C39+E39,\"\")","v":1},{"$f":"IF(AND(D39<>\"\",F39<>\"\"),D39+F39,\"\")","v":7},0,4,3,"III",null,{"$f":"IF(AND($B37<>\"\",$B38<>\"\"),$B37,\"\")","v":"Schmidt/Drücker/Mohr"},3,1,{"$f":"IF(AND($B38<>\"\",$B37<>\"\"),$B38,\"\")","v":"Schön/Landau/Bönsch"}]

{"sheet":"Hauptfeld","index":1,"n_rows":36,"n_cols":24,"rows_kept":36,"cut":false,"hidden":false,"merged":[[0,0,0,9],[0,18,0,19],[19,13,19,14]]}
[{"$f":"\"Hauptrunde   ( \"&MAX(S2:S17)&\" Teilnehmer = \"&MAX(S2:S17)&\"  Spiele )\"","v":"Hauptrunde   ( 16 Teilnehmer = 16  Spiele )"},null,null,null,null,null,null,null,null,null,null,null,null,null,null,null,null,null,"Teilnehmer",null,null,3,{"$f":"IF(V1=1,\"Satz\",\" Gewinnsätze\")","v":" Gewinnsätze"}]
[null,null,null,null,null,null,null,null,null,null,null,null,null,null,null,null,null,null,1,"Langwaldt/Jensen/Hamer",{"$f":"IF(OR(T2=0,V$2<>\"A\"),101,RAND()*100)","v":101},null,{"$f":"IF(V2=\"a\",\" Auslosung\",\"\")","v":""}]
[null,null,null,null,null,null,null,null,null,null,null,null,null,null,null,null,null,null,2,"Bruchlos/Busch/Lauenroth",101]
[null,"  I",null,null,"  II",null,"  III",null,null,null,null,null,null,"Endergebnis:   1.",null,{"$f":"IF(AND(U36<V1,V36<V1),0,IF(U36>V36,T36,W36))","v":"Grzymek/Glaeßner/Reinert"},null,null,3,"Militzer/Braun/Kirschner",101]
[1,{"$f":"T2","v":"Langwaldt/Jensen/Hamer"},{"$f":"IF(OR(B5=0,B7=0),\"\",U19)","v":1},null,null,null,null,null,null,null,null,null,null,null,null,null,null,null,4,"Schmidt/Drücker/Mohr",101]
[null,null,null,{"$f":"IF(B7=0,B5,IF(C5=C7,-1,IF(C5>C7,B5,B7)))","v":"Militzer/Braun/Kirschner"},{"$f":"IF(OR(B15<>0,AND(E14=0,D18=0),AND(E14<>0,D18<>0)),D6,IF(ABS(C5-C7)>=ABS(C9-C11),D6,0))","v":"Militzer/Braun/Kirschner"},{"$f":"IF(OR(E6=0,E10=0),\"\",U27)","v":0},null,null,null,null,null,null,null,"2.",null,{"$f":"IF(AND(U36<V1,V36<V1),0,IF(U36<V36,T36,W36))","v":"Rothenhäuser/Teuber/Koglin"},null,null,5,"Hickisch/Michalski/Trinh",101]
[null,{"$f":"T4","v":"Militzer/Braun/Kirschner"},{"$f":"IF(OR(B5=0,B7=0),\"\",V19)","v":3},null,null,null,null,null,null,null,null,null,null,null,null,null,null,null,6,"Benz/Peters/Wieben",101]
[null,null,null,null,null,null,{"$f":"IF(E6=0,E10,IF(E10=0,E6,IF(F6=F10,-1,IF(F6>F10,E6,E10))))","v":"Hickisch/Michalski/Trinh"},{"$f":"IF(OR(G8=0,G16=0),\"\",U31)","v":2},null,null,null,null,null,"3.",null,{"$f":"IF(AND(U34<V1,V34<V1),0,IF(U34>V34,T34,W34))","v":0},null,null,7,"Otto/Drücker/Willmann",101]
[2,{"$f":"T6","v":"Hickisch/Michalski/Trinh"},{"$f":"IF(OR(B9=0,B11=0),\"\",U20)","v":3},null,null,null,null,null,null,null,null,null,null,null,null,null,null,null,8,"Nitz/Ptach/Schlösser",101]
[null,null,null,{"$f":"IF(B11=0,B9,IF(C9=C11,-1,IF(C9>C11,B9,B11)))","v":"Hickisch/Michalski/Trinh"},{"$f":"IF(OR(B15<>0,AND(E14=0,D18=0),AND(E14<>0,D18<>0)),D10,IF(ABS(C5-C7)>=ABS(C9-C11),0,D10))","v":"Hickisch/Michalski/Trinh"},{"$f":"IF(OR(E6=0,E10=0),\"\",V27)","v":3},null,null,null,null,null,null,null,"4.",null,{"$f":"IF(AND(U34<V1,V34<V1),0,IF(U34<V34,T34,W34))","v":0},null,null,9,"Lubke/Stegemann/Abert",101]
[null,{"$f":"T8","v":"Otto/Drücker/Willmann"},{"$f":"IF(OR(B9=0,B11=0),\"\",V20)","v":2},null,null,null,null,null,null,null,null,null,null,null,null,null,null,null,10,"Diebold/Tröger/Hoffmann",101]
[null,null,null,null,null,null,null,null,null,null,null,{"$f":"IF(G8=0,G16,IF(G16=0,G8,IF(H8=H16,-1,IF(H8>H16,G8,G16))))","v":"Grzymek/Glaeßner/Reinert"},{"$f":"IF(OR(L12=0,L28=0),\"\",U36)","v":3},null,null,null,null,null,11,"Schön/Landau/Bönsch",101]
[3,{"$f":"T10","v":"Lubke/Stegemann/Abert"},{"$f":"IF(OR(B13=0,B15=0),\"\",U21)","v":3},null,null,null,null,null,null,null,null,null,null,null,null,null,null,null,12,"Mählhop/Ott/Mocker",101]
[null,null,null,null,{"$f":"IF(B15=0,B13,IF(C13=C15,-1,IF(C13>C15,B13,B15)))","v":"Lubke/Stegemann/Abert"},{"$f":"IF(OR(E14=0,E18=0),\"\",U28)","v":2},null,null,null,null,null,null,null,null,null,null,null,null,13,"Pätz/Wandmaker/Kostny",101]
[null,{"$f":"T12","v":"Schön/Landau/Bönsch"},{"$f":"IF(OR(B13=0,B15=0),\"\",V21)","v":1},null,null,null,null,null,null,null,null,null,null,null,null,null,null,null,14,"Rothenhäuser/Teuber/Koglin",101]
[null,null,null,null,null,null,{"$f":"IF(E14=0,E18,IF(E18=0,E14,IF(F14=F18,-1,IF(F14>F18,E14,E18))))","v":"Grzymek/Glaeßner/Reinert"},{"$f":"IF(OR(G8=0,G16=0),\"\",V31)","v":3},null,null,null,null,null,null,null,null,null,null,15,"Grzymek/Glaeßner/Reinert",101]
[4,{"$f":"T14","v":"Pätz/Wandmaker/Kostny"},{"$f":"IF(OR(B17=0,B19=0),\"\",U22)","v":2},null,null,null,null,null,null,null,null,null,null,null,null,null,null,null,16,"Schmidt/Maier/Jettinger",101,{"$f":"IF(COUNTIF(U19:V36,V1)=MAX(S2:S17),\"\",\"bisher \"&COUNTIF(U19:V36,V1)&\" von \"&MAX(S2:S17)&\" Spielen\")","v":"bisher 15 von 16 Spielen"}]
[null,null,null,{"$f":"IF(B19=0,B17,IF(C17=C19,-1,IF(C17>C19,B17,B19)))","v":"Grzymek/Glaeßner/Reinert"},{"$f":"IF(OR(B15<>0,D18<>0,E14=0),D18,IF(AND(E14<>0,D18=0),IF(E6=0,D6,D10)))","v":"Grzymek/Glaeßner/Reinert"},{"$f":"IF(OR(E14=0,E18=0),\"\",V28)","v":3}]
[null,{"$f":"T16","v":"Grzymek/Glaeßner/Reinert"},{"$f":"IF(OR(B17=0,B19=0),\"\",V22)","v":3},null,null,null,null,null,null,null,null,null,null,null,null,null,null,"I",1,{"$f":"B5","v":"Langwaldt/Jensen/Hamer"},1,3,{"$f":"B7","v":"Militzer/Braun/Kirschner"},{"$f":"IF(OR(AND(T19=0,W19<>0),AND(T19<>0,W19=0)),\"Freilos\",IF(AND(T19=0,W19=0),\"nicht besetzt\",\"\"))","v":""}]
[null,null,null,null,null,null,null,null,null,null,null,null,null,{"$f":"IF(AND(M12=0,M28=0),\"\",IF(M12>M28,L12,L28))","v":"Grzymek/Glaeßner/Reinert"},null,null,null,null,2,{"$f":"B9","v":"Hickisch/Michalski/Trinh"},3,2,{"$f":"B11","v":"Otto/Drücker/Willmann"},""]
[5,{"$f":"T17","v":"Schmidt/Maier/Jettinger"},{"$f":"IF(OR(B21=0,B23=0),\"\",U23)","v":1},null,null,null,null,null,null,null,null,null,null,null,null,null,null,null,3,{"$f":"B13","v":"Lubke/Stegemann/Abert"},3,1,{"$f":"B15","v":"Schön/Landau/Bönsch"},""]
[null,null,null,{"$f":"IF(B21=0,B23,IF(B23=0,B21,IF(C21=C23,-1,IF(C21>C23,B21,B23))))","v":"Rothenhäuser/Teuber/Koglin"},{"$f":"IF(OR(B25<>0,D22<>0,E26=0),D22,IF(AND(E26<>0,D22=0),IF(E34=0,D34,D30)))","v":"Rothenhäuser/Teuber/Koglin"},{"$f":"IF(OR(E22=0,E26=0),\"\",U29)","v":3},null,null,null,null,null,null,null,null,null,null,null,null,4,{"$f":"B17","v":"Pätz/Wandmaker/Kostny"},2,3,{"$f":"B19","v":"Grzymek/Glaeßner/Reinert"},""]
[null,{"$f":"T15","v":"Rothenhäuser/Teuber/Koglin"},{"$f":"IF(OR(B21=0,B23=0),\"\",V23)","v":3},null,null,null,null,null,null,null,null,null,null,null,null,null,null,null,5,{"$f":"B21","v":"Schmidt/Maier/Jettinger"},1,3,{"$f":"B23","v":"Rothenhäuser/Teuber/Koglin"},""]
[null,null,null,null,null,null,{"$f":"IF(E22=0,E26,IF(E26=0,E22,IF(F22=F26,-1,IF(F22>F26,E22,E26))))","v":"Rothenhäuser/Teuber/Koglin"},{"$f":"IF(OR(G24=0,G32=0),\"\",U32)","v":3},null,null,null,null,null,null,null,null,null,null,6,{"$f":"B25","v":"Mählhop/Ott/Mocker"},1,3,{"$f":"B27","v":"Diebold/Tröger/Hoffmann"},""]
[6,{"$f":"T13","v":"Mählhop/Ott/Mocker"},{"$f":"IF(OR(B25=0,B27=0),\"\",U24)","v":1},null,null,null,null,null,null,null,null,null,null,null,null,null,null,null,7,{"$f":"B29","v":"Nitz/Ptach/Schlösser"},1,3,{"$f":"B31","v":"Benz/Peters/Wieben"},""]
[null,null,null,null,{"$f":"IF(B25=0,B27,IF(B27=0,B25,IF(C25=C27,-1,IF(C25>C27,B25,B27))))","v":"Diebold/Tröger/Hoffmann"},{"$f":"IF(OR(E22=0,E26=0),\"\",V29)","v":0},null,null,null,null,null,null,null,null,null,null,null,null,8,{"$f":"B33","v":"Schmidt/Drücker/Mohr"},3,2,{"$f":"B35","v":"Bruchlos/Busch/Lauenroth"},""]
[null,{"$f":"T11","v":"Diebold/Tröger/Hoffmann"},{"$f":"IF(OR(B25=0,B27=0),\"\",V24)","v":3},null,null,null,null,null,null,null,null,null,null,null,null,null,null,"II",1,{"$f":"E6","v":"Militzer/Braun/Kirschner"},0,3,{"$f":"E10","v":"Hickisch/Michalski/Trinh"},""]
[null,null,null,null,null,null,null,null,null,null,null,{"$f":"IF(G24=0,G32,IF(G32=0,G24,IF(H24=H32,-1,IF(H24>H32,G24,G32))))","v":"Rothenhäuser/Teuber/Koglin"},{"$f":"IF(OR(L12=0,L28=0),\"\",V36)","v":2},null,null,null,null,null,2,{"$f":"E14","v":"Lubke/Stegemann/Abert"},2,3,{"$f":"E18","v":"Grzymek/Glaeßner/Reinert"},""]
[7,{"$f":"T9","v":"Nitz/Ptach/Schlösser"},{"$f":"IF(OR(B29=0,B31=0),\"\",U25)","v":1},null,null,null,null,null,null,null,null,null,null,null,null,null,null,null,3,{"$f":"E22","v":"Rothenhäuser/Teuber/Koglin"},3,0,{"$f":"E26","v":"Diebold/Tröger/Hoffmann"},""]
[null,null,null,{"$f":"IF(B29=0,B31,IF(B31=0,B29,IF(C29=C31,-1,IF(C29>C31,B29,B31))))","v":"Benz/Peters/Wieben"},{"$f":"IF(OR(B25<>0,AND(E26=0,D22=0),AND(E26<>0,D22<>0)),D30,IF(ABS(C35-C33)>=ABS(C31-C29),0,D30))","v":"Benz/Peters/Wieben"},{"$f":"IF(OR(E30=0,E34=0),\"\",U30)","v":1},null,null,null,null,null,null,null,null,null,null,null,null,4,{"$f":"E30","v":"Benz/Peters/Wieben"},1,3,{"$f":"E34","v":"Schmidt/Drücker/Mohr"},""]
[null,{"$f":"T7","v":"Benz/Peters/Wieben"},{"$f":"IF(OR(B29=0,B31=0),\"\",V25)","v":3},null,null,null,null,null,null,null,null,null,null,null,null,null,null,"III",1,{"$f":"G8","v":"Hickisch/Michalski/Trinh"},2,3,{"$f":"G16","v":"Grzymek/Glaeßner/Reinert"},""]
[null,null,null,null,null,null,{"$f":"IF(E30=0,E34,IF(E34=0,E30,IF(F30=F34,-1,IF(F30>F34,E30,E34))))","v":"Schmidt/Drücker/Mohr"},{"$f":"IF(OR(G24=0,G32=0),\"\",V32)","v":2},null,null,null,null,null,null,null,null,null,null,2,{"$f":"G24","v":"Rothenhäuser/Teuber/Koglin"},3,2,{"$f":"G32","v":"Schmidt/Drücker/Mohr"},""]
[8,{"$f":"T5","v":"Schmidt/Drücker/Mohr"},{"$f":"IF(OR(B33=0,B35=0),\"\",U26)","v":3}]
[null,null,null,{"$f":"IF(B33=0,B35,IF(B35=0,B33,IF(C33=C35,-1,IF(C33>C35,B33,B35))))","v":"Schmidt/Drücker/Mohr"},{"$f":"IF(OR(B25<>0,AND(E26=0,D22=0),AND(E26<>0,D22<>0)),D34,IF(ABS(C35-C33)>=ABS(C31-C29),D34,0))","v":"Schmidt/Drücker/Mohr"},{"$f":"IF(OR(E30=0,E34=0),\"\",V30)","v":3},null,null,null,null,null,null,null,null,null,null,null,null,null,{"$f":"IF(AND(U32<V1,V32<V1),0,IF(U32<V32,T32,W32))","v":"Schmidt/Drücker/Mohr"},null,null,{"$f":"IF(AND(U31<V1,V31<V1),0,IF(U31<V31,T31,W31))","v":"Hickisch/Michalski/Trinh"}," Spiel um Platz 3"]
[null,{"$f":"T3","v":"Bruchlos/Busch/Lauenroth"},{"$f":"IF(OR(B33=0,B35=0),\"\",V26)","v":2}]
[null,null,null,null,null,null,null,null,null,null,null,null,null,null,null,null,null,null,null,{"$f":"L12","v":"Grzymek/Glaeßner/Reinert"},3,2,{"$f":"L28","v":"Rothenhäuser/Teuber/Koglin"},"Endspiel"]

{"sheet":"Trostrunde","index":2,"n_rows":36,"n_cols":24,"rows_kept":36,"cut":false,"hidden":false,"merged":[[0,0,0,9],[0,18,0,19],[19,13,19,14]]}
[{"$f":"\"Trostrunde   ( \"&MAX(S2:S17)&\" Teilnehmer = \"&MAX(S2:S17)&\"  Spiele )\"","v":"Trostrunde   ( 8 Teilnehmer = 8  Spiele )"},null,null,null,null,null,null,null,null,null,null,null,null,null,null,null,null,null,"Teilnehmer",null,null,3,{"$f":"IF(V1=1,\"Satz\",\" Gewinnsätze\")","v":" Gewinnsätze"}]
[null,null,null,null,null,null,null,null,null,null,null,null,null,null,null,null,null,null,1,"Grote/Dohrn/Ly",{"$f":"IF(OR(T2=0,V$2<>\"A\"),101,RAND()*100)","v":101},null,{"$f":"IF(V2=\"a\",\" Auslosung\",\"\")","v":""}]
[null,null,null,null,null,null,null,null,null,null,null,null,null,null,null,null,null,null,2,"Dunker/Schulz/Cirksena",101]
[null,"  I",null,null,"  II",null,"  III",null,null,null,null,null,null,"Endergebnis:   1.",null,{"$f":"IF(AND(U36<V1,V36<V1),0,IF(U36>V36,T36,W36))","v":"Grote/Dohrn/Ly"},null,null,3,"Fust/Scholz/Garbe",101]
[1,{"$f":"T2","v":"Grote/Dohrn/Ly"},{"$f":"IF(OR(B5=0,B7=0),\"\",U19)","v":3},null,null,null,null,null,null,null,null,null,null,null,null,null,null,null,4,"Deichmann/Indinger/Fittkau",101]
[null,null,null,{"$f":"IF(B7=0,B5,IF(C5=C7,-1,IF(C5>C7,B5,B7)))","v":"Grote/Dohrn/Ly"},{"$f":"IF(OR(B15<>0,AND(E14=0,D18=0),AND(E14<>0,D18<>0)),D6,IF(ABS(C5-C7)>=ABS(C9-C11),D6,0))","v":"Grote/Dohrn/Ly"},{"$f":"IF(OR(E6=0,E10=0),\"\",U27)","v":3},null,null,null,null,null,null,null,"2.",null,{"$f":"IF(AND(U36<V1,V36<V1),0,IF(U36<V36,T36,W36))","v":"Dunker/Schulz/Cirksena"},null,null,5,"Mittelstädt/Heide/Voigt",101]
[null,{"$f":"T4","v":"Fust/Scholz/Garbe"},{"$f":"IF(OR(B5=0,B7=0),\"\",V19)","v":0},null,null,null,null,null,null,null,null,null,null,null,null,null,null,null,6,"Bohnensack",101]
[null,null,null,null,null,null,{"$f":"IF(E6=0,E10,IF(E10=0,E6,IF(F6=F10,-1,IF(F6>F10,E6,E10))))","v":"Grote/Dohrn/Ly"},{"$f":"IF(OR(G8=0,G16=0),\"\",U31)","v":""},null,null,null,null,null,"3.",null,{"$f":"IF(AND(U34<V1,V34<V1),0,IF(U34>V34,T34,W34))","v":0},null,null,7,"Krüger/Krüger/Harth",101]
[2,{"$f":"T6","v":"Mittelstädt/Heide/Voigt"},{"$f":"IF(OR(B9=0,B11=0),\"\",U20)","v":2},null,null,null,null,null,null,null,null,null,null,null,null,null,null,null,8,"Krüger/Krüger/Gutschy",101]
[null,null,null,{"$f":"IF(B11=0,B9,IF(C9=C11,-1,IF(C9>C11,B9,B11)))","v":"Krüger/Krüger/Harth"},{"$f":"IF(OR(B15<>0,AND(E14=0,D18=0),AND(E14<>0,D18<>0)),D10,IF(ABS(C5-C7)>=ABS(C9-C11),0,D10))","v":"Krüger/Krüger/Harth"},{"$f":"IF(OR(E6=0,E10=0),\"\",V27)","v":1},null,null,null,null,null,null,null,"4.",null,{"$f":"IF(AND(U34<V1,V34<V1),0,IF(U34<V34,T34,W34))","v":0},null,null,null,null,101]
[null,{"$f":"T8","v":"Krüger/Krüger/Harth"},{"$f":"IF(OR(B9=0,B11=0),\"\",V20)","v":3},null,null,null,null,null,null,null,null,null,null,null,null,null,null,null,null,null,101]
[null,null,null,null,null,null,null,null,null,null,null,{"$f":"IF(G8=0,G16,IF(G16=0,G8,IF(H8=H16,-1,IF(H8>H16,G8,G16))))","v":"Grote/Dohrn/Ly"},{"$f":"IF(OR(L12=0,L28=0),\"\",U36)","v":3},null,null,null,null,null,null,null,101]
[3,{"$f":"T10","v":0},{"$f":"IF(OR(B13=0,B15=0),\"\",U21)","v":""},null,null,null,null,null,null,null,null,null,null,null,null,null,null,null,null,null,101]
[null,null,null,null,{"$f":"IF(B15=0,B13,IF(C13=C15,-1,IF(C13>C15,B13,B15)))","v":0},{"$f":"IF(OR(E14=0,E18=0),\"\",U28)","v":""},null,null,null,null,null,null,null,null,null,null,null,null,null,null,101]
[null,{"$f":"T12","v":0},{"$f":"IF(OR(B13=0,B15=0),\"\",V21)","v":""},null,null,null,null,null,null,null,null,null,null,null,null,null,null,null,null,null,101]
[null,null,null,null,null,null,{"$f":"IF(E14=0,E18,IF(E18=0,E14,IF(F14=F18,-1,IF(F14>F18,E14,E18))))","v":0},{"$f":"IF(OR(G8=0,G16=0),\"\",V31)","v":""},null,null,null,null,null,null,null,null,null,null,null,null,101]
[4,{"$f":"T14","v":0},{"$f":"IF(OR(B17=0,B19=0),\"\",U22)","v":""},null,null,null,null,null,null,null,null,null,null,null,null,null,null,null,null,null,101,{"$f":"IF(COUNTIF(U19:V36,V1)=MAX(S2:S17),\"\",\"bisher \"&COUNTIF(U19:V36,V1)&\" von \"&MAX(S2:S17)&\" Spielen\")","v":"bisher 7 von 8 Spielen"}]
[null,null,null,{"$f":"IF(B19=0,B17,IF(C17=C19,-1,IF(C17>C19,B17,B19)))","v":0},{"$f":"IF(OR(B15<>0,D18<>0,E14=0),D18,IF(AND(E14<>0,D18=0),IF(E6=0,D6,D10)))","v":0},{"$f":"IF(OR(E14=0,E18=0),\"\",V28)","v":""}]
[null,{"$f":"T16","v":0},{"$f":"IF(OR(B17=0,B19=0),\"\",V22)","v":""},null,null,null,null,null,null,null,null,null,null,null,null,null,null,"I",1,{"$f":"B5","v":"Grote/Dohrn/Ly"},3,0,{"$f":"B7","v":"Fust/Scholz/Garbe"},{"$f":"IF(OR(AND(T19=0,W19<>0),AND(T19<>0,W19=0)),\"Freilos\",IF(AND(T19=0,W19=0),\"nicht besetzt\",\"\"))","v":""}]
[null,null,null,null,null,null,null,null,null,null,null,null,null,{"$f":"IF(AND(M12=0,M28=0),\"\",IF(M12>M28,L12,L28))","v":"Grote/Dohrn/Ly"},null,null,null,null,2,{"$f":"B9","v":"Mittelstädt/Heide/Voigt"},2,3,{"$f":"B11","v":"Krüger/Krüger/Harth"},""]
[5,{"$f":"T17","v":0},{"$f":"IF(OR(B21=0,B23=0),\"\",U23)","v":""},null,null,null,null,null,null,null,null,null,null,null,null,null,null,null,3,{"$f":"B13","v":0},null,null,{"$f":"B15","v":0},"nicht besetzt"]
[null,null,null,{"$f":"IF(B21=0,B23,IF(B23=0,B21,IF(C21=C23,-1,IF(C21>C23,B21,B23))))","v":0},{"$f":"IF(OR(B25<>0,D22<>0,E26=0),D22,IF(AND(E26<>0,D22=0),IF(E34=0,D34,D30)))","v":0},{"$f":"IF(OR(E22=0,E26=0),\"\",U29)","v":""},null,null,null,null,null,null,null,null,null,null,null,null,4,{"$f":"B17","v":0},null,null,{"$f":"B19","v":0},"nicht besetzt"]
[null,{"$f":"T15","v":0},{"$f":"IF(OR(B21=0,B23=0),\"\",V23)","v":""},null,null,null,null,null,null,null,null,null,null,null,null,null,null,null,5,{"$f":"B21","v":0},null,null,{"$f":"B23","v":0},"nicht besetzt"]
[null,null,null,null,null,null,{"$f":"IF(E22=0,E26,IF(E26=0,E22,IF(F22=F26,-1,IF(F22>F26,E22,E26))))","v":0},{"$f":"IF(OR(G24=0,G32=0),\"\",U32)","v":""},null,null,null,null,null,null,null,null,null,null,6,{"$f":"B25","v":0},null,null,{"$f":"B27","v":0},"nicht besetzt"]
[6,{"$f":"T13","v":0},{"$f":"IF(OR(B25=0,B27=0),\"\",U24)","v":""},null,null,null,null,null,null,null,null,null,null,null,null,null,null,null,7,{"$f":"B29","v":"Krüger/Krüger/Gutschy"},3,2,{"$f":"B31","v":"Bohnensack"},""]
[null,null,null,null,{"$f":"IF(B25=0,B27,IF(B27=0,B25,IF(C25=C27,-1,IF(C25>C27,B25,B27))))","v":0},{"$f":"IF(OR(E22=0,E26=0),\"\",V29)","v":""},null,null,null,null,null,null,null,null,null,null,null,null,8,{"$f":"B33","v":"Deichmann/Indinger/Fittkau"},2,3,{"$f":"B35","v":"Dunker/Schulz/Cirksena"},""]
[null,{"$f":"T11","v":0},{"$f":"IF(OR(B25=0,B27=0),\"\",V24)","v":""},null,null,null,null,null,null,null,null,null,null,null,null,null,null,"II",1,{"$f":"E6","v":"Grote/Dohrn/Ly"},3,1,{"$f":"E10","v":"Krüger/Krüger/Harth"},""]
[null,null,null,null,null,null,null,null,null,null,null,{"$f":"IF(G24=0,G32,IF(G32=0,G24,IF(H24=H32,-1,IF(H24>H32,G24,G32))))","v":"Dunker/Schulz/Cirksena"},{"$f":"IF(OR(L12=0,L28=0),\"\",V36)","v":2},null,null,null,null,null,2,{"$f":"E14","v":0},null,null,{"$f":"E18","v":0},"nicht besetzt"]
[7,{"$f":"T9","v":"Krüger/Krüger/Gutschy"},{"$f":"IF(OR(B29=0,B31=0),\"\",U25)","v":3},null,null,null,null,null,null,null,null,null,null,null,null,null,null,null,3,{"$f":"E22","v":0},null,null,{"$f":"E26","v":0},"nicht besetzt"]
[null,null,null,{"$f":"IF(B29=0,B31,IF(B31=0,B29,IF(C29=C31,-1,IF(C29>C31,B29,B31))))","v":"Krüger/Krüger/Gutschy"},{"$f":"IF(OR(B25<>0,AND(E26=0,D22=0),AND(E26<>0,D22<>0)),D30,IF(ABS(C35-C33)>=ABS(C31-C29),0,D30))","v":"Krüger/Krüger/Gutschy"},{"$f":"IF(OR(E30=0,E34=0),\"\",U30)","v":2},null,null,null,null,null,null,null,null,null,null,null,null,4,{"$f":"E30","v":"Krüger/Krüger/Gutschy"},2,3,{"$f":"E34","v":"Dunker/Schulz/Cirksena"},""]
[null,{"$f":"T7","v":"Bohnensack"},{"$f":"IF(OR(B29=0,B31=0),\"\",V25)","v":2},null,null,null,null,null,null,null,null,null,null,null,null,null,null,"III",1,{"$f":"G8","v":"Grote/Dohrn/Ly"},null,null,{"$f":"G16","v":0},"Freilos"]
[null,null,null,null,null,null,{"$f":"IF(E30=0,E34,IF(E34=0,E30,IF(F30=F34,-1,IF(F30>F34,E30,E34))))","v":"Dunker/Schulz/Cirksena"},{"$f":"IF(OR(G24=0,G32=0),\"\",V32)","v":""},null,null,null,null,null,null,null,null,null,null,2,{"$f":"G24","v":0},null,null,{"$f":"G32","v":"Dunker/Schulz/Cirksena"},"Freilos"]
[8,{"$f":"T5","v":"Deichmann/Indinger/Fittkau"},{"$f":"IF(OR(B33=0,B35=0),\"\",U26)","v":2}]
[null,null,null,{"$f":"IF(B33=0,B35,IF(B35=0,B33,IF(C33=C35,-1,IF(C33>C35,B33,B35))))","v":"Dunker/Schulz/Cirksena"},{"$f":"IF(OR(B25<>0,AND(E26=0,D22=0),AND(E26<>0,D22<>0)),D34,IF(ABS(C35-C33)>=ABS(C31-C29),D34,0))","v":"Dunker/Schulz/Cirksena"},{"$f":"IF(OR(E30=0,E34=0),\"\",V30)","v":3},null,null,null,null,null,null,null,null,null,null,null,null,null,{"$f":"IF(AND(U32<V1,V32<V1),0,IF(U32<V32,T32,W32))","v":0},null,null,{"$f":"IF(AND(U31<V1,V31<V1),0,IF(U31<V31,T31,W31))","v":0}," Spiel um Platz 3"]
[null,{"$f":"T3","v":"Dunker/Schulz/Cirksena"},{"$f":"IF(OR(B33=0,B35=0),\"\",V26)","v":3}]
[null,null,null,null,null,null,null,null,null,null,null,null,null,null,null,null,null,null,null,{"$f":"L12","v":"Grote/Dohrn/Ly"},3,2,{"$f":"L28","v":"Dunker/Schulz/Cirksena"},"Endspiel"]